Home > Configure Error > Configure Error C Compiler Cannot Create Executables Ubuntu 10.04

Configure Error C Compiler Cannot Create Executables Ubuntu 10.04

gawk [ALL? ]??? current community chat Stack Overflow Meta Stack Overflow your communities Sign up or log in to customize your list. Page 1 of 2 12 Last Jump to page: Results 1 to 10 of 11 Thread: C compiler cannot compile executables Thread Tools Show Printable Version Subscribe to this Thread… Display That basically means that the default set of options that configure is using is causing GCC to get an error. his comment is here

I couldn't find a satisfactory answer to this on the forum. checking whether /usr/bin/make sets $(MAKE)... eholz1 Adv Reply September 23rd, 2010 #7 spjackson View Profile View Forum Posts Private Message Cake for coffee's sake Join Date Aug 2010 Location Lancs, United Kingdom Beans 1,286 DistroUbuntu Should I allow my child to make an alternate meal if they do not like anything served at mealtime?

Is it anti-pattern if a class property creates and returns a new instance of a class? powerpc-860-linux-uclibc [ALL? ]??? I could not change the permissions on any of the files in my dir, even as root!.

yes checking whether make supports nested variables... Tango Icons Tango Desktop Project. I had one once. Actually the c compiler will not compile anything!

Why won't curl download this link when a browser will? Thanks Very Much, eholz1 (aka eric) Adv Reply September 24th, 2010 #9 eholz1 View Profile View Forum Posts Private Message Spilled the Beans Join Date Aug 2008 Beans 14 Re: no checking for style of include used by make... more hot questions question feed lang-bsh about us tour help blog chat data legal privacy policy work here advertising info mobile contact us feedback Technology Life / Arts Culture / Recreation

Need to change cash to cashier's check without bank account (Just arrived to the US) How to be Recommended to be a Sitecore MVP How can I take a powerful plot powerpc-860-linux-uclibc [ALL? ]??? gcc checking whether the C compiler works... I am trying to compile ImageMagick.

  • Do you want to help us debug the posting issues ? < is the place to report it, thanks !
  • How safe is 48V DC?
  • checking for powerpc-860-linux-uclibc-strip... /home/crawford/x-tools/powerpc-860-linux-uclibc/powerpc-860-linux-uclibc/bin/strip [ALL? ]???
  • Don't tell me to get a life.
  • You need to remove it.
  • checking target system type...
  • eholz1 (eric) Adv Reply September 24th, 2010 #10 Queue29 View Profile View Forum Posts Private Message Visit Homepage Tea Glorious Tea!
  • Adv Reply April 16th, 2011 #2 myhieu View Profile View Forum Posts Private Message 5 Cups of Ubuntu Join Date May 2010 Location Vietnam Beans 19 Re: C compiler cannot

Halting the installation. https://ubuntuforums.org/showthread.php?t=1730350 The time now is 05:23 PM. That basically means that the default set of options that configure is using is causing GCC to get an error. Or would it create a problem for other programs? –naka Sep 19 '13 at 12:50 @Gilles I have edited my answer to reflect your comment @naka I advise against

Is privacy compromised when sharing SHA-1 hashed URLs? http://homeshareware.com/configure-error/configure-error-c-compiler-cannot-create-executables-osx-10-6.html checking whether build environment is sane... yes [ALL? ]??? on track with rails!

How to interpret torque spec ranges? Whether that works or not, what's the output of the following? GO OUT AND VOTE more hot questions question feed lang-c about us tour help blog chat data legal privacy policy work here advertising info mobile contact us feedback Technology Life / http://homeshareware.com/configure-error/configure-error-c-compiler-cannot-create-executables-ubuntu-11-10.html any help would be great as the compiler fails on anytime I try to use it, not just with this install.

checking for --enable-version-specific-runtime-libs... Code: $ uname -a Adv Reply September 23rd, 2010 #8 eholz1 View Profile View Forum Posts Private Message Spilled the Beans Join Date Aug 2008 Beans 14 Re: C compiler Playing: Portal, NFS Most Wanted Watching: Futurama Reading: A Clockwork Orange Kibet on Flickr More Photos action configure nagios controller flash games casual gaming offline download git how to install install

It sucked.

I may (or may not) have a weird issue. Ubuntu Logo, Ubuntu and Canonical Canonical Ltd. Look at '/home/crawford/x-tools/powerpc-860-linux-uclibc/build.log' for more info on this error. [ERROR]? (elapsed: 31:24.46) Doug ----- Original Message ---- From: Arnaud Lacombe To: Doug Crawford Cc: [email protected] Sent: Thu, September 9, How to react?

They really helped me out and got me going again. My bet is that the error is along the lines of "Cannot find cc1". make[2]: *** [configure-stage1-target-libgomp] Error 77 make[2]: Leaving directory `/var/tmp/gdcStuff/gdc/dev/gcc-4.6.1/objdir' make[1]: *** [stage1-bubble] Error 2 make[1]: Leaving directory `/var/tmp/gdcStuff/gdc/dev/gcc-4.6.1/objdir' make: *** [all] Error 2 Somehow, this error does not occur on my http://homeshareware.com/configure-error/configure-error-c-compiler-cannot-create-executables-aix-5-3.html configure: error: in `/var/tmp/gdcStuff/gdc/dev/gcc-4.6.1/objdir/x86_64-unknown-linux-gnu/libgomp': configure: error: C compiler cannot create executables See `config.log' for more details.

checking build system type... GNU checking for gcc... rm -rf /var/tmp/gdcStuff mkdir /var/tmp/gdcStuff cp -R * /var/tmp/gdcStuff # Copies the gcc bzip file cd /var/tmp/gdcStuff hg clone https://bitbucket.org/goshawk/gdc mkdir gdc/dev cd gdc/dev tar -xvf ../../gcc-4.6.1.tar.bz2 cd gcc-4.6.1 ln -s Is there a patch that was applied to gcc 4.4.x that I need to > also apply to gcc 4.3.x or gcc 4.5.x??

Do Morpheus and his crew kill potential Ones? no configure: error: in `/home/mike/cpuminer-2.4.2': configure: error: C compiler cannot create executables my system is ubuntu 14.04 and the system details say the os is 32 bit. Ubuntu Ubuntu Insights Planet Ubuntu Activity Page Please read before SSO login Advanced Search Forum The Ubuntu Forum Community Ubuntu Specialised Support Development & Programming Programming Talk C compiler cannot compile I tried the ./configure command again with no variables and all went well.

no [ALL? ]??? Page 1 of 2 12 Last Jump to page: Results 1 to 10 of 20 Thread: C compiler cannot create executable Thread Tools Show Printable Version Subscribe to this Thread… Display dsimcha (4/14) Sep 27 2011 Another way to fix this is apparently to just disable the bootstrap feat... While it might be possible to make this work, I strongly suggest you change the installation directory to a path that does not contain any spaces at all, and stick to

Global.asax Application_Start not hit after upgrade to Sitecore 8.2 How to interpret torque spec ranges? I will list the info you requested first. vBulletin 2000 - 2016, Jelsoft Enterprises Ltd. It did pop me into a maintenance prompt.

Browse other questions tagged gcc ubuntu compilation or ask your own question. Why should I care what my compiler was compiled with? Should I allow my child to make an alternate meal if they do not like anything served at mealtime? configure: error: C compiler cannot create executables [ALL? ]???

Back to Top